BDBM379024 Preparation of 2-[1-(4-cyclopropyl-2,6-difluorobenzyl)-1H-indazol-3-yl]-5-methoxy-N-(pyridin-4-yl)pyrimidin-4-amine::US10266548, Example 6-1
SMILES COc1cnc(nc1Nc1ccncc1)-c1nn(Cc2c(F)cc(cc2F)C2CC2)c2ccccc12
InChI Key InChIKey=BSVZTHQKGPELJW-UHFFFAOYSA-N
Data  1 IC50
  Tab Delimited (TSV)   2D SDfile   Computed 3D by Vconf -m prep SDfile
Find this compound or compounds like it in BindingDB:
Activity Spreadsheet -- Enzyme Inhibition Constant Data from BindingDB
Found 1 hit for monomerid = 379024
TargetMitotic checkpoint serine/threonine-protein kinase BUB1(Homo sapiens (Human))
Bayer Intellectual Property
US Patent
LigandPNGBDBM379024(Preparation of 2-[1-(4-cyclopropyl-2,6-difluoroben...)
Affinity DataIC50:  3.90nM. Assay description: Bub1-inhibitory activities of compounds described in the present invention were quantified using a time-resolved fluorescence energy transfer (TR-FRE...
Ligand InfoPC cidPC sid
In DepthDetails US Patent