BDBM379351 N4-cyclopropyl-N2-(6-methoxypyridin-2-yl)-5-(trifluoromethyl)pyrimidine-2,4-diamine::US10266549, Example 229::US10774092, Example 229
SMILES COc1cccc(Nc2ncc(c(NC3CC3)n2)C(F)(F)F)n1
InChI Key InChIKey=PCCIHOLQUAZUBY-UHFFFAOYSA-N
Data  2 IC50
  Tab Delimited (TSV)   2D SDfile   Computed 3D by Vconf -m prep SDfile
Find this compound or compounds like it in BindingDB:
Activity Spreadsheet -- Enzyme Inhibition Constant Data from BindingDB
Found 2 hits for monomerid = 379351
TargetSerine/threonine-protein kinase ULK1(Homo sapiens (Human))
Salk Institute For Biological Studies
US Patent
LigandPNGBDBM379351(N4-cyclopropyl-N2-(6-methoxypyridin-2-yl)-5-(trifl...)
Affinity DataIC50: <200nM. Assay description: ULK1 inhibition assay is a screening assay to identify compounds that inhibit kinase activity of ULK1 using the ULKtide peptide. In some embodiments,...
Ligand InfoPC cidPC sid
In DepthDetails US Patent
TargetSerine/threonine-protein kinase ULK1(Homo sapiens (Human))
Salk Institute For Biological Studies
US Patent
LigandPNGBDBM379351(N4-cyclopropyl-N2-(6-methoxypyridin-2-yl)-5-(trifl...)
Affinity DataIC50: <200nM. Assay description: Gamma-32P assays to measure ULK1 kinase activity were performed as previously described. Briefly, Flag ULK1 was transfected into HEK293T cells and 20...
Ligand InfoPC cidPC sid
In DepthDetails US Patent