BDBM379356 5,5′-((5-bromopyrimidine-2,4-diyl)bis(azanediyl))bis(1,3-dihydro-2H-benzo[d]imidazol-2-one)::US10266549, Example 233::US10774092, Example 233
SMILES Brc1cnc(Nc2ccc3[nH]c(=O)[nH]c3c2)nc1Nc1ccc2[nH]c(=O)[nH]c2c1
InChI Key InChIKey=FPRQGPIVXXBHOH-UHFFFAOYSA-N
Data  2 IC50
  Tab Delimited (TSV)   2D SDfile   Computed 3D by Vconf -m prep SDfile
Find this compound or compounds like it in BindingDB:
Activity Spreadsheet -- Enzyme Inhibition Constant Data from BindingDB
Found 2 hits for monomerid = 379356
TargetSerine/threonine-protein kinase ULK1(Homo sapiens (Human))
Salk Institute For Biological Studies
US Patent
LigandPNGBDBM379356(5,5′-((5-bromopyrimidine-2,4-diyl)bis(azaned...)
Affinity DataIC50: <200nM. Assay description: ULK1 inhibition assay is a screening assay to identify compounds that inhibit kinase activity of ULK1 using the ULKtide peptide. In some embodiments,...
Ligand InfoPC cidPC sid
In DepthDetails US Patent
TargetSerine/threonine-protein kinase ULK1(Homo sapiens (Human))
Salk Institute For Biological Studies
US Patent
LigandPNGBDBM379356(5,5′-((5-bromopyrimidine-2,4-diyl)bis(azaned...)
Affinity DataIC50: <200nM. Assay description: Gamma-32P assays to measure ULK1 kinase activity were performed as previously described. Briefly, Flag ULK1 was transfected into HEK293T cells and 20...
Ligand InfoPC cidPC sid
In DepthDetails US Patent