BDBM37940 6-(2-phenoxyethylsulfanyl)-7H-purine::6-(2-phenoxyethylthio)-7H-purine::MLS000107592::SMR000111957::cid_1615867
SMILES C(CSc1ncnc2nc[nH]c12)Oc1ccccc1
InChI Key InChIKey=LISMPHSRTXYGFG-UHFFFAOYSA-N
Data  1 IC50
  Tab Delimited (TSV)   2D SDfile   Computed 3D by Vconf -m prep SDfile
Find this compound or compounds like it in BindingDB:
Activity Spreadsheet -- Enzyme Inhibition Constant Data from BindingDB
Found 1 hit for monomerid = 37940
TargetcAMP-dependent protein kinase catalytic subunit alpha(Homo sapiens (Human))
The Scripps Research Institute Molecular Screening Center
Curated by PubChem BioAssay
LigandPNGBDBM37940(6-(2-phenoxyethylsulfanyl)-7H-purine | 6-(2-phenox...)
Affinity DataIC50:  2.46E+4nM. Assay description: Source (MLSCN Center Name): The Scripps Research Institute Molecular Screening Center Center Affiliation: The Scripps Research Institute, TSRI Assay ...
In DepthDetails PCBioAssay