BDBM37954 1,1,1,3,3,3-Hexafluoropropan-2-yl 4-(2-((4- (tert-butoxy)-4-oxobutyl)amino)-4- (trifluoromethyl)benzyl)piperazine-1- carboxylate::US10093635, Example 2
SMILES CC(C)(C)OC(=O)CCCNc1cc(ccc1CN1CCN(CC1)C(=O)OC(C(F)(F)F)C(F)(F)F)C(F)(F)F
InChI Key InChIKey=VMNYXYDPHKHXOJ-UHFFFAOYSA-N
Data  1 IC50
  Tab Delimited (TSV)   2D SDfile   Computed 3D by Vconf -m prep SDfile
Find this compound or compounds like it in BindingDB:
Activity Spreadsheet -- Enzyme Inhibition Constant Data from BindingDB
Found 1 hit for monomerid = 37954
TargetMonoglyceride lipase(Homo sapiens (Human))
Abide Therapeutics
US Patent
LigandPNGBDBM37954(1,1,1,3,3,3-Hexafluoropropan-2-yl 4-(2-((4- (tert-...)
Affinity DataIC50:  5.50E+3nMT: 2°C. Assay description: Proteomes (human prefrontal cortex or cell membrane fractions) (50 μL, 1.0-2.0 mg/mL total protein concentration) were preincubated with varying...
Ligand InfoPC cidPC sid
In DepthDetails US Patent