BDBM37969 3-(4-Fluoro-phenyl)-1-(3-morpholin-4-yl-propyl)-1-(6-oxo-5,6-dihydro-[1,3]dioxolo[4,5-g]quinolin-7-ylmethyl)-urea::3-(4-fluorophenyl)-1-(3-morpholin-4-ylpropyl)-1-[(6-oxidanylidene-5H-[1,3]dioxolo[4,5-g]quinolin-7-yl)methyl]urea::3-(4-fluorophenyl)-1-(3-morpholin-4-ylpropyl)-1-[(6-oxo-5H-[1,3]dioxolo[4,5-g]quinolin-7-yl)methyl]urea::3-(4-fluorophenyl)-1-[(6-keto-5H-[1,3]dioxolo[4,5-g]quinolin-7-yl)methyl]-1-(3-morpholinopropyl)urea::3-(4-fluorophenyl)-1-[3-(4-morpholinyl)propyl]-1-[(6-oxo-5H-[1,3]dioxolo[4,5-g]quinolin-7-yl)methyl]urea::MLS000034288::SMR000004162::cid_648044
SMILES Fc1ccc(NC(=O)N(CCCN2CCOCC2)Cc2cc3cc4OCOc4cc3[nH]c2=O)cc1
InChI Key InChIKey=UYKUQPQBGBIASR-UHFFFAOYSA-N
Data  1 IC50
  Tab Delimited (TSV)   2D SDfile   Computed 3D by Vconf -m prep SDfile
Find this compound or compounds like it in BindingDB:
Activity Spreadsheet -- Enzyme Inhibition Constant Data from BindingDB
Found 1 hit for monomerid = 37969
TargetDiphosphomevalonate decarboxylase(Streptococcus pneumoniae D39)
Srmlsc
Curated by PubChem BioAssay
LigandPNGBDBM37969(3-(4-Fluoro-phenyl)-1-(3-morpholin-4-yl-propyl)-1-...)
Affinity DataIC50:  1.76E+4nM. Assay description: Southern Research Molecular Libraries Screening Center (SRMLSC) Southern Research Institute (Birmingham, Alabama) NIH Molecular Libraries Screening C...
In DepthDetails PCBioAssay