BDBM379872 US9926281, Compound 379
SMILES C[C@@H](C[C@]1(NC(=O)NC1=O)C1CC1)C(=O)N1CCN([C@@H](C)C1)c1cc(F)cc(c1)-c1cn[nH]c1
InChI Key
Data  3 IC50
  Tab Delimited (TSV)   2D SDfile   Computed 3D by Vconf -m prep SDfile
Find this compound or compounds like it in BindingDB:
Activity Spreadsheet -- Enzyme Inhibition Constant Data from BindingDB
Found 3 hits for monomerid = 379872
TargetA disintegrin and metalloproteinase with thrombospondin motifs 5(Homo sapiens (Human))
Galapagos
US Patent
LigandPNGBDBM379872(US9926281, Compound 379)
Affinity DataIC50:  18nM. Assay description: ADAMTS-5:Protocol 2: The basis for the assay is the cleavage of the substrate TBIS-1 (5 FAM-TEGEARGSVILLK (5TAMRA)K-NH2) (SEQ ID No 2) by human ADAMT...
Ligand InfoPC cidPC sid
In DepthDetails US Patent
Target72 kDa type IV collagenase(Homo sapiens (Human))
Galapagos
US Patent
LigandPNGBDBM379872(US9926281, Compound 379)
Affinity DataIC50:  407nM. Assay description: MMP2: Protocol 2: The basis for the assay is the cleavage of the substrate 390 MMP FRET substrate I (Anaspec, Catalog n#: AS-27076) by human MMP2 (R&...
Ligand InfoPC cidPC sid
In DepthDetails US Patent
TargetDisintegrin and metalloproteinase domain-containing protein 17(Homo sapiens (Human))
Galapagos
US Patent
LigandPNGBDBM379872(US9926281, Compound 379)
Affinity DataIC50:  1.49E+3nM. Assay description: TACE:The basis for the assay is the cleavage of the substrate 5FAM-LAQAVRSSSRK-5TAMRA (SEQ ID No 3) (Anaspec, custom 34891) by human TACE (R&D SYSTEM...
Ligand InfoPC cidPC sid
In DepthDetails US Patent