BDBM37990 1,1,1,3,3,3-hexafluoropropan-2-yl 4-(3-fluoro- 4-methyl-2-((1- ((methylsulfonyl)carbamoyl)cyclopropyl) methoxy)benzyl)piperazine-1-carboxylate::US10093635, Example 31
SMILES Cc1ccc(CN2CCN(CC2)C(=O)OC(C(F)(F)F)C(F)(F)F)c(OCC2(CC2)C(=O)NS(C)(=O)=O)c1F
InChI Key InChIKey=KTSRGLNPLHBBPJ-UHFFFAOYSA-N
Data  1 IC50
  Tab Delimited (TSV)   2D SDfile   Computed 3D by Vconf -m prep SDfile
Find this compound or compounds like it in BindingDB:
Activity Spreadsheet -- Enzyme Inhibition Constant Data from BindingDB
Found 1 hit for monomerid = 37990
TargetMonoglyceride lipase(Homo sapiens (Human))
Abide Therapeutics
US Patent
LigandPNGBDBM37990(1,1,1,3,3,3-hexafluoropropan-2-yl 4-(3-fluoro- 4-m...)
Affinity DataIC50:  5.50E+3nMT: 2°C. Assay description: Proteomes (human prefrontal cortex or cell membrane fractions) (50 μL, 1.0-2.0 mg/mL total protein concentration) were preincubated with varying...
In DepthDetails US Patent