BDBM380436 (R)-1-(1-acryloylpyrrolidin-3-yl)-5-amino-3-(4-(2-chlorophenoxyl)phenyl)-1H-pyrazole-4-carboxamide::US9926299, 45
SMILES NC(=O)c1c(N)n(nc1-c1ccc(Oc2ccccc2Cl)cc1)[C@@H]1CCN(C1)C(=O)C=C
InChI Key InChIKey=SLLUGDALXPEADN-OAHLLOKOSA-N
Data  1 IC50
  Tab Delimited (TSV)   2D SDfile   Computed 3D by Vconf -m prep SDfile
Find this compound or compounds like it in BindingDB:
Activity Spreadsheet -- Enzyme Inhibition Constant Data from BindingDB
Found 1 hit for monomerid = 380436
TargetTyrosine-protein kinase BTK(Homo sapiens (Human))
Centaurus Biopharma
US Patent
LigandPNGBDBM380436((R)-1-(1-acryloylpyrrolidin-3-yl)-5-amino-3-(4-(2-...)
Affinity DataIC50: <100nM. Assay description: Btk kinase activity was determined using a Homogeneous Time-Resolved Fluorescence (HTRF) methodology (Cisbio). Measurements were performed in a react...
Ligand InfoPC cidPC sid
In DepthDetails US Patent