BDBM380462 US9926306, ID 183-70
SMILES CC(C)(C)Cc1cs\c(=N/C2CCCCC2)n1\N=C\c1ccc(O)c(O)c1O
InChI Key InChIKey=IFPVENYQMYOSTD-MPAXWDSHSA-N
Data  1 IC50
  Tab Delimited (TSV)   2D SDfile   Computed 3D by Vconf -m prep SDfile
Find this compound or compounds like it in BindingDB:
Activity Spreadsheet -- Enzyme Inhibition Constant Data from BindingDB
Found 1 hit for monomerid = 380462
TargetInduced myeloid leukemia cell differentiation protein Mcl-1 homolog(Mus musculus (Mouse))
Dana-Farber Cancer Institute
US Patent
LigandPNGBDBM380462(US9926306, ID 183-70)
Affinity DataIC50:  1.97nM. Assay description: A high-throughput competitive fluorescence polarization (FP) screening assay (Z-factor, 0.62) was developed based on the direct binding interaction b...
Ligand InfoPC cidPC sid
In DepthDetails US Patent