BDBM380518 US9926318, 1-133
SMILES OC(=O)CCN1C(=O)[C@@H]2Cc3c(CN2C1=O)n(Cc1ccc(Cl)cc1F)c1ccccc31
InChI Key InChIKey=VMFDSXXYAIDCRK-IBGZPJMESA-N
Data  1 IC50
  Tab Delimited (TSV)   2D SDfile   Computed 3D by Vconf -m prep SDfile
Find this compound or compounds like it in BindingDB:
Activity Spreadsheet -- Enzyme Inhibition Constant Data from BindingDB
Found 1 hit for monomerid = 380518
TargetEctonucleotide pyrophosphatase/phosphodiesterase family member 2(Homo sapiens (Human))
Pharmakea
US Patent
LigandPNGBDBM380518(US9926318, 1-133)
Affinity DataIC50: <500nM. Assay description: ATX activity is assayed in concentrated conditioned media from Hep3B human hepatocellular carcinoma cells by measuring the amount of choline released...
Ligand InfoPC cidPC sid
In DepthDetails US Patent