BDBM380546 2-amino-N,N-dipropyl-8-(3-pyrrolidin-1-ylsulfonylphenyl)-3H-1-benzazepine-4-carboxamide::US9890124, 3
SMILES CCCN(CCC)C(=O)C1=Cc2ccc(cc2N=C(N)C1)-c1cccc(c1)S(=O)(=O)N1CCCC1
InChI Key InChIKey=AOFYOBTXXBPKDK-UHFFFAOYSA-N
Data  2 EC50
  Tab Delimited (TSV)   2D SDfile   Computed 3D by Vconf -m prep SDfile
Find this compound or compounds like it in BindingDB:
Activity Spreadsheet -- Enzyme Inhibition Constant Data from BindingDB
Found 2 hits for monomerid = 380546
TargetToll-like receptor 7(Homo sapiens (Human))
Hoffmann-La Roche
US Patent
LigandPNGBDBM380546(2-amino-N,N-dipropyl-8-(3-pyrrolidin-1-ylsulfonylp...)
Affinity DataEC50: >1.00E+5nM
Ligand InfoPC cidPC sid
In DepthDetails US Patent
TargetToll-like receptor 8(Homo sapiens (Human))
Hoffmann-La Roche
US Patent
LigandPNGBDBM380546(2-amino-N,N-dipropyl-8-(3-pyrrolidin-1-ylsulfonylp...)
Affinity DataEC50:  6nM. Assay description: For TLR8 and TLR7 activity testing, HEK-Blue human TLR8 or TLR7 cells (Invivogen, San Diego, Calif., USA) are used, respectively. These cells are des...
Ligand InfoPC cidPC sid
In DepthDetails US Patent