BDBM380608 2-Amino-8-[3-[[(3R)-3-hydroxy-1-piperidyl]sulfonyl]phenyl]-N,N-dipropyl-3H-1-benzazepine-4-carboxamide::US9890124, 17
SMILES CCCN(CCC)C(=O)C1=Cc2ccc(cc2N=C(N)C1)-c1cccc(c1)S(=O)(=O)N1CCC[C@@H](O)C1
InChI Key InChIKey=KJKMCOPGSVTGAP-XMMPIXPASA-N
Data  2 EC50
  Tab Delimited (TSV)   2D SDfile   Computed 3D by Vconf -m prep SDfile
Find this compound or compounds like it in BindingDB:
Activity Spreadsheet -- Enzyme Inhibition Constant Data from BindingDB
Found 2 hits for monomerid = 380608
TargetToll-like receptor 7(Homo sapiens (Human))
Hoffmann-La Roche
US Patent
LigandPNGBDBM380608(2-Amino-8-[3-[[(3R)-3-hydroxy-1-piperidyl]sulfonyl...)
Affinity DataEC50: >1.00E+5nM
Ligand InfoPC cidPC sid
In DepthDetails US Patent
TargetToll-like receptor 8(Homo sapiens (Human))
Hoffmann-La Roche
US Patent
LigandPNGBDBM380608(2-Amino-8-[3-[[(3R)-3-hydroxy-1-piperidyl]sulfonyl...)
Affinity DataEC50:  5nM. Assay description: For TLR8 and TLR7 activity testing, HEK-Blue human TLR8 or TLR7 cells (Invivogen, San Diego, Calif., USA) are used, respectively. These cells are des...
Ligand InfoPC cidPC sid
In DepthDetails US Patent