BDBM380789 N-(2-((2-(dimethylamino)ethyl)(methyl)amino)-4-methoxy-5-(4-phenyl-7H-pyrrolo[2,3-d]pyrimidin-2-ylamino)phenyl)acrylamide ::US9890168, Compound 7
SMILES COc1cc(N(C)CCN(C)C)c(NC(=O)C=C)cc1Nc1nc(-c2ccccc2)c2cc[nH]c2n1
InChI Key InChIKey=GTNZEAVPIDJENJ-UHFFFAOYSA-N
Data  2 IC50
  Tab Delimited (TSV)   2D SDfile   Computed 3D by Vconf -m prep SDfile
Find this compound or compounds like it in BindingDB:
Activity Spreadsheet -- Enzyme Inhibition Constant Data from BindingDB
Found 2 hits for monomerid = 380789
TargetEpidermal growth factor receptor(Homo sapiens (Human))
Shanghai Haiyan Pharmaceutical Technology
US Patent
LigandPNGBDBM380789(N-(2-((2-(dimethylamino)ethyl)(methyl)amino)-4-met...)
Affinity DataIC50:  315nM. Assay description: The inhibitory activities on T790M/L858R double mutant EGFR kinase (Invitrogen, PV4879) and wild-type EGFR kinase (Invitrogen, PV3872) were determine...
Ligand InfoPC cidPC sid
In DepthDetails US Patent
TargetEpidermal growth factor receptor [T790M,L858R](Homo sapiens (Human))
Shanghai Haiyan Pharmaceutical Technology
US Patent
LigandPNGBDBM380789(N-(2-((2-(dimethylamino)ethyl)(methyl)amino)-4-met...)
Affinity DataIC50:  20nM. Assay description: The inhibitory activities on T790M/L858R double mutant EGFR kinase (Invitrogen, PV4879) and wild-type EGFR kinase (Invitrogen, PV3872) were determine...
Ligand InfoPC cidPC sid
In DepthDetails US Patent