BDBM380971 8-(4-Fluoro-1-methyl-1H-indazol-6- yl)-4-methyl-3,4-dihydro-1H- pyrano[4,3-c]pyridin-4-ol, Enantiomer II::US9890171, 175::US9890171, 176
SMILES Cn1ncc2c(F)cc(cc12)-c1cncc2c1COCC2(C)O
InChI Key InChIKey=XPTJKQMSAQURPA-UHFFFAOYSA-N
Data  2 IC50
  Tab Delimited (TSV)   2D SDfile   Computed 3D by Vconf -m prep SDfile
Find this compound or compounds like it in BindingDB:
Activity Spreadsheet -- Enzyme Inhibition Constant Data from BindingDB
Found 2 hits for monomerid = 380971
TargetCytochrome P450 11B2, mitochondrial(Homo sapiens (Human))
Boehringer Ingelheim International
US Patent
LigandPNGBDBM380971(8-(4-Fluoro-1-methyl-1H-indazol-6- yl)-4-methyl-3,...)
Affinity DataIC50:  13.4nM. Assay description: The aldosterone synthase inhibition assay employs cynomolgus adrenal gland mitochondria as the source of aldosterone synthase (CYP11B2). Mitochondria...
Ligand InfoPC cidPC sid
In DepthDetails US Patent
TargetCytochrome P450 11B2, mitochondrial(Homo sapiens (Human))
Boehringer Ingelheim International
US Patent
LigandPNGBDBM380971(8-(4-Fluoro-1-methyl-1H-indazol-6- yl)-4-methyl-3,...)
Affinity DataIC50:  21.6nM. Assay description: The aldosterone synthase inhibition assay employs cynomolgus adrenal gland mitochondria as the source of aldosterone synthase (CYP11B2). Mitochondria...
Ligand InfoPC cidPC sid
In DepthDetails US Patent