BDBM380997 US9890185, Example 1
SMILES COCCOCCOCCOc1cc(Nc2nccc(Oc3ccc(NC(=O)Nc4cc(cc(c4OC)P(C)(C)=O)C(C)(C)C)c4ccccc34)n2)cc(OC)c1
InChI Key InChIKey=WBBZJXHOJATBAX-UHFFFAOYSA-N
Data  4 IC50
  Tab Delimited (TSV)   2D SDfile   Computed 3D by Vconf -m prep SDfile
Find this compound or compounds like it in BindingDB:
Activity Spreadsheet -- Enzyme Inhibition Constant Data from BindingDB
Found 4 hits for monomerid = 380997
TargetMitogen-activated protein kinase 14(Homo sapiens (Human))
Respivert
US Patent
LigandPNGBDBM380997(US9890185, Example 1)
Affinity DataIC50:  34nM. Assay description: Method 1: The inhibitory activities of test compounds against the p38 MAPKα isoform (MAPK14: Invitrogen), are evaluated indirectly by determinin...
Ligand InfoPC cidPC sid
In DepthDetails US Patent
TargetGlycogen synthase kinase-3 alpha(Homo sapiens (Human))
Respivert
US Patent
LigandPNGBDBM380997(US9890185, Example 1)
Affinity DataIC50:  330nM. Assay description: Method 1: The inhibitory activities of compounds of the invention against the GSK 3α enzyme isoform (Invitrogen), are evaluated by determining ...
Ligand InfoPC cidPC sid
In DepthDetails US Patent
TargetTyrosine-protein kinase SYK(Homo sapiens (Human))
Respivert
US Patent
LigandPNGBDBM380997(US9890185, Example 1)
Affinity DataIC50:  30nM. Assay description: Method 2: The inhibitory activities of compounds of the invention against p38MAPKγ (MAPK12: Invitrogen), are evaluated in a similar fashion to t...
Ligand InfoPC cidPC sid
In DepthDetails US Patent
TargetProto-oncogene tyrosine-protein kinase Src(Homo sapiens (Human))
Respivert
US Patent
LigandPNGBDBM380997(US9890185, Example 1)
Affinity DataIC50:  9nM. Assay description: The inhibitory activities of compounds of the invention against c-Src and Syk enzymes (Invitrogen), are evaluated in a similar fashion to that descri...
Ligand InfoPC cidPC sid
In DepthDetails US Patent