BDBM381123 1-(5-(tert-Butyl)-2-methoxy-3-(methylsulfinyl)phenyl)-3-(4-((2-((pyridin-2-ylmethyl)amino)pyridin-4-yl)oxy)naphthalen-1-yl)urea::US9890185, Example 42
SMILES COc1c(NC(=O)Nc2ccc(Oc3ccnc(NCc4ccccn4)c3)c3ccccc23)cc(cc1S(C)=O)C(C)(C)C
InChI Key InChIKey=IZLRLLYJGJIQME-UHFFFAOYSA-N
Data  4 IC50
  Tab Delimited (TSV)   2D SDfile   Computed 3D by Vconf -m prep SDfile
Find this compound or compounds like it in BindingDB:
Activity Spreadsheet -- Enzyme Inhibition Constant Data from BindingDB
Found 4 hits for monomerid = 381123
TargetMitogen-activated protein kinase 14(Homo sapiens (Human))
Respivert
US Patent
LigandPNGBDBM381123(1-(5-(tert-Butyl)-2-methoxy-3-(methylsulfinyl)phen...)
Affinity DataIC50:  8nM. Assay description: Method 1: The inhibitory activities of test compounds against the p38 MAPKα isoform (MAPK14: Invitrogen), are evaluated indirectly by determinin...
Ligand InfoPC cidPC sid
In DepthDetails US Patent
TargetGlycogen synthase kinase-3 alpha(Homo sapiens (Human))
Respivert
US Patent
LigandPNGBDBM381123(1-(5-(tert-Butyl)-2-methoxy-3-(methylsulfinyl)phen...)
Affinity DataIC50:  3.41E+3nM. Assay description: Method 1: The inhibitory activities of compounds of the invention against the GSK 3α enzyme isoform (Invitrogen), are evaluated by determining ...
Ligand InfoPC cidPC sid
In DepthDetails US Patent
TargetTyrosine-protein kinase SYK(Homo sapiens (Human))
Respivert
US Patent
LigandPNGBDBM381123(1-(5-(tert-Butyl)-2-methoxy-3-(methylsulfinyl)phen...)
Affinity DataIC50: >1.64E+3nM. Assay description: Method 2: The inhibitory activities of compounds of the invention against p38MAPKγ (MAPK12: Invitrogen), are evaluated in a similar fashion to t...
Ligand InfoPC cidPC sid
In DepthDetails US Patent
TargetProto-oncogene tyrosine-protein kinase Src(Homo sapiens (Human))
Respivert
US Patent
LigandPNGBDBM381123(1-(5-(tert-Butyl)-2-methoxy-3-(methylsulfinyl)phen...)
Affinity DataIC50: >1.64E+3nM. Assay description: The inhibitory activities of compounds of the invention against c-Src and Syk enzymes (Invitrogen), are evaluated in a similar fashion to that descri...
Ligand InfoPC cidPC sid
In DepthDetails US Patent