BDBM381741 US10272079, Compound 98
SMILES O[C@H]([C@@H](O)C(=O)NCCOCCOCCNS(=O)(=O)c1ccc(O[C@@H]2[C@H](Cc3ccccc23)N2CCCCC2)cc1)C(=O)NCCOCCOCCNS(=O)(=O)c1ccc(O[C@@H]2[C@H](Cc3ccccc23)N2CCCCC2)cc1
InChI Key InChIKey=HDGZWIAEZJRQLN-OHAFZUPBSA-N
Data  2 IC50
  Tab Delimited (TSV)   2D SDfile   Computed 3D by Vconf -m prep SDfile
Find this compound or compounds like it in BindingDB:
Activity Spreadsheet -- Enzyme Inhibition Constant Data from BindingDB
Found 2 hits for monomerid = 381741
TargetSodium/hydrogen exchanger 3(Homo sapiens (Human))
Ardelyx
US Patent
LigandPNGBDBM381741(US10272079, Compound 98)
Affinity DataIC50:  7.94nM. Assay description: Cell-based activity under Prompt Conditions. Rat or human NHE3-mediated Na+-dependent H+ antiport was measured using a modification of the pH sensiti...
Ligand InfoPC cidPC sid
In DepthDetails US Patent
TargetSodium/hydrogen exchanger 3(Rattus norvegicus)
Ardelyx
US Patent
LigandPNGBDBM381741(US10272079, Compound 98)
Affinity DataIC50:  3.98nM. Assay description: Cell-based activity under Prompt Conditions. Rat or human NHE3-mediated Na+-dependent H+ antiport was measured using a modification of the pH sensiti...
Ligand InfoPC cidPC sid
In DepthDetails US Patent