BDBM381841 3-(3-(8-Cyano-2,2-dimethyl-2,3-dihydrobenzo[f][1,4]oxazepin-4(5H)-yl)-2,3-dihydro-1H-inden-5-yl)-3-(1,4-dimethyl-1H-benzo[d][1,2,3]triazol-5-yl)propanoic Acid, Formic Acid Salt::US10272095, Example 35
SMILES Cc1c(ccc2n(C)nnc12)C(CC(O)=O)c1ccc2CCC(N3Cc4ccc(cc4OC(C)(C)C3)C#N)c2c1
InChI Key InChIKey=CKUBVABVZOPXJW-UHFFFAOYSA-N
Data  1 EC50
  Tab Delimited (TSV)   2D SDfile   Computed 3D by Vconf -m prep SDfile
Find this compound or compounds like it in BindingDB:
Activity Spreadsheet -- Enzyme Inhibition Constant Data from BindingDB
Found 1 hit for monomerid = 381841
TargetNAD(P)H dehydrogenase [quinone] 1(Homo sapiens (Human))
Glaxosmithkline
US Patent
LigandPNGBDBM381841(3-(3-(8-Cyano-2,2-dimethyl-2,3-dihydrobenzo[f][1,4...)
Affinity DataEC50:  5.5nM. Assay description: NAD(P)H:quinone oxidoreductase 1 (NQO1), also called DT diaphorase, is a homodimeric FAD-containing enzyme that catalyzes obligatory NAD(P)H-dependen...
Ligand InfoPC cidPC sid
In DepthDetails US Patent