BDBM381885 3-(3-(2,2-Dimethyl-2,3-dihydropyrido[3,4-f][1,4]oxazepin-4(5H)-yl)-2,3-dihydro-1H-inden-5-yl)-3-(7-methoxy-1-methyl-1H-benzo[d][1,2,3]triazol-5-yl)propanoic Acid, Formic Acid Salt::US10272095, Example 46
SMILES COc1cc(cc2nnn(C)c12)C(CC(O)=O)c1ccc2CCC(N3Cc4cnccc4OC(C)(C)C3)c2c1
InChI Key InChIKey=AUBRCHVTBWHTON-UHFFFAOYSA-N
Data  1 EC50
  Tab Delimited (TSV)   2D SDfile   Computed 3D by Vconf -m prep SDfile
Find this compound or compounds like it in BindingDB:
Activity Spreadsheet -- Enzyme Inhibition Constant Data from BindingDB
Found 1 hit for monomerid = 381885
TargetNAD(P)H dehydrogenase [quinone] 1(Homo sapiens (Human))
Glaxosmithkline
US Patent
LigandPNGBDBM381885(3-(3-(2,2-Dimethyl-2,3-dihydropyrido[3,4-f][1,4]ox...)
Affinity DataEC50:  55nM. Assay description: NAD(P)H:quinone oxidoreductase 1 (NQO1), also called DT diaphorase, is a homodimeric FAD-containing enzyme that catalyzes obligatory NAD(P)H-dependen...
Ligand InfoPC cidPC sid
In DepthDetails US Patent