BDBM381954 US10273214, Example 1418
SMILES Cc1sc(NC(=O)c2ccc(cc2)C(C)(C)C)c(C(O)=O)c1C
InChI Key InChIKey=SZWFRYMHGAWGCD-UHFFFAOYSA-N
Data  2 IC50
  Tab Delimited (TSV)   2D SDfile   Computed 3D by Vconf -m prep SDfile
Find this compound or compounds like it in BindingDB:
Activity Spreadsheet -- Enzyme Inhibition Constant Data from BindingDB
Found 2 hits for monomerid = 381954
TargetGlutamate receptor ionotropic, NMDA 2D(Homo sapiens (Human))
Emory University
US Patent
LigandPNGBDBM381954(US10273214, Example 1418)
Affinity DataIC50:  3.50E+4nM
In DepthDetails US Patent
TargetGlutamate receptor ionotropic, NMDA 2C(Homo sapiens (Human))
Emory University
US Patent
LigandPNGBDBM381954(US10273214, Example 1418)
Affinity DataIC50:  3.30E+4nM. Assay description: The assay involves using a cell line that expresses the NR1 subunit together with either NR2C or NR2D. These cell lines can be prepared by transfecti...
In DepthDetails US Patent