BDBM381965 US10273214, Example 1433
SMILES Cc1sc(NC(=O)c2ccc(cc2)C(C)(C)C)c(C(N)=O)c1C
InChI Key InChIKey=BZIKOVHNWYNBHB-UHFFFAOYSA-N
Data  2 IC50
  Tab Delimited (TSV)   2D SDfile   Computed 3D by Vconf -m prep SDfile
Find this compound or compounds like it in BindingDB:
Activity Spreadsheet -- Enzyme Inhibition Constant Data from BindingDB
Found 2 hits for monomerid = 381965
TargetGlutamate receptor ionotropic, NMDA 2D(Homo sapiens (Human))
Emory University
US Patent
LigandPNGBDBM381965(US10273214, Example 1433)
Affinity DataIC50:  3.40E+4nM
In DepthDetails US Patent
TargetGlutamate receptor ionotropic, NMDA 2C(Homo sapiens (Human))
Emory University
US Patent
LigandPNGBDBM381965(US10273214, Example 1433)
Affinity DataIC50:  5.10E+4nM. Assay description: The assay involves using a cell line that expresses the NR1 subunit together with either NR2C or NR2D. These cell lines can be prepared by transfecti...
In DepthDetails US Patent