BDBM382069 2-[1-[(4- chlorophenyl)methyl]imidazol-4- yl]-4-(2H-tetrazol-5-yl)pyridine::US10273222, Example 131
SMILES Clc1ccc(Cn2cnc(c2)-c2cc(ccn2)-c2nn[nH]n2)cc1
InChI Key InChIKey=BDSGDBHMKQRXML-UHFFFAOYSA-N
Data  2 IC50
  Tab Delimited (TSV)   2D SDfile   Computed 3D by Vconf -m prep SDfile
Find this compound or compounds like it in BindingDB:
Activity Spreadsheet -- Enzyme Inhibition Constant Data from BindingDB
Found 2 hits for monomerid = 382069
TargetLysine-specific demethylase 2B(Homo sapiens (Human))
Celgene Quantscel Research
US Patent
LigandPNGBDBM382069(2-[1-[(4- chlorophenyl)methyl]imidazol-4- yl]-4-(2...)
Affinity DataIC50: <100nM. Assay description: The ability of test compounds to inhibit the activity of FBXL10 was determined in 384-well plate format under the following reaction conditions: 0.3 ...
Ligand InfoPC cidPC sid
In DepthDetails US Patent
TargetLysine-specific demethylase 4C(Homo sapiens (Human))
Celgene Quantscel Research
US Patent
LigandPNGBDBM382069(2-[1-[(4- chlorophenyl)methyl]imidazol-4- yl]-4-(2...)
Affinity DataIC50:  5.50E+3nM. Assay description: The ability of test compounds to inhibit the activity of JMJD2C was determined in 384-well plate format under the following reaction conditions: 0.3 ...
Ligand InfoPC cidPC sid
In DepthDetails US Patent