BDBM382153 1-((5-((trans-4-isopropylcyclohexyl)oxy)naphthalen-2-yl)methyl)piperidine-4-carboxylic acid::US10273234, Example 13
SMILES CC(C)[C@H]1CC[C@@H](CC1)Oc1cccc2cc(CN3CCC(CC3)C(O)=O)ccc12
InChI Key InChIKey=UKOZRHULOVRMEM-JKIUYZKVSA-N
Data  1 IC50
  Tab Delimited (TSV)   2D SDfile   Computed 3D by Vconf -m prep SDfile
Find this compound or compounds like it in BindingDB:
Activity Spreadsheet -- Enzyme Inhibition Constant Data from BindingDB
Found 1 hit for monomerid = 382153
TargetEctonucleotide pyrophosphatase/phosphodiesterase family member 2(Homo sapiens (Human))
Biogen Ma
US Patent
LigandPNGBDBM382153(1-((5-((trans-4-isopropylcyclohexyl)oxy)naphthalen...)
Affinity DataIC50:  2.75E+3nM. Assay description: ATX (Autotaxin) is a 125 KDa glycoprotein with lysophospholipase D (LPLD) activity that generates the bioactive lipid lysophosphatidic acid (LPA) fro...
Ligand InfoPC cidPC sid
In DepthDetails US Patent