BDBM382169 1-((5-((trans-4-cyclopentylcyclohexyl)oxy)naphthalen-2-yl)methyl)azetidine-3-carboxylic acid::US10273234, Example 23
SMILES OC(=O)C1CN(Cc2ccc3c(O[C@H]4CC[C@@H](CC4)C4CCCC4)cccc3c2)C1
InChI Key InChIKey=XWLJSHHCULRCBN-JKIUYZKVSA-N
Data  1 IC50
  Tab Delimited (TSV)   2D SDfile   Computed 3D by Vconf -m prep SDfile
Find this compound or compounds like it in BindingDB:
Activity Spreadsheet -- Enzyme Inhibition Constant Data from BindingDB
Found 1 hit for monomerid = 382169
TargetEctonucleotide pyrophosphatase/phosphodiesterase family member 2(Homo sapiens (Human))
Biogen Ma
US Patent
LigandPNGBDBM382169(1-((5-((trans-4-cyclopentylcyclohexyl)oxy)naphthal...)
Affinity DataIC50: >5.00E+3nM. Assay description: ATX (Autotaxin) is a 125 KDa glycoprotein with lysophospholipase D (LPLD) activity that generates the bioactive lipid lysophosphatidic acid (LPA) fro...
Ligand InfoPC cidPC sid
In DepthDetails US Patent