BDBM382320 US10273244, Example 201::US10584135, Example 201
SMILES Cn1c(SCCCN2CC3CCN(C3C2)c2c(F)cccc2F)nnc1-c1ccc(nc1)C(N)=O
InChI Key InChIKey=DVRLZAJGBLYQFK-UHFFFAOYSA-N
Data  4 KI
  Tab Delimited (TSV)   2D SDfile   Computed 3D by Vconf -m prep SDfile
Find this compound or compounds like it in BindingDB:
Activity Spreadsheet -- Enzyme Inhibition Constant Data from BindingDB
Found 4 hits for monomerid = 382320
TargetD(3) dopamine receptor(Homo sapiens (Human))
Indivior
US Patent
LigandPNGBDBM382320(US10273244, Example 201 | US10584135, Example 201)
Affinity DataKi:  1.41nM. Assay description: [3H]-Spiperone Binding Assay at hD3 and hD4 recombinant receptors CHO cells transiently transfected with human dopamine type 3 or 4 receptors (CHO-hD...
Ligand InfoPC cidPC sid
In DepthDetails US Patent
TargetD(3) dopamine receptor(Homo sapiens (Human))
Indivior
US Patent
LigandPNGBDBM382320(US10273244, Example 201 | US10584135, Example 201)
Affinity DataKi:  1.41nM. Assay description: 3H]-Spiperone Binding Assay at hD3 and hD4 recombinant receptors CHO cells transiently transfected with human dopamine type 3 or 4 receptors (CHO-hD3...
Ligand InfoPC cidPC sid
In DepthDetails US Patent
TargetD(2) dopamine receptor(Homo sapiens (Human))
Indivior
US Patent
LigandPNGBDBM382320(US10273244, Example 201 | US10584135, Example 201)
Affinity DataKi:  724nM. Assay description: CHO cells stably expressing human dopamine receptor type 2, long variant (hD2L), coupled to Gα16 protein (CHO-Gα16-hD2L) were re-suspended ...
Ligand InfoPC cidPC sid
In DepthDetails US Patent
TargetD(2) dopamine receptor(Homo sapiens (Human))
Indivior
US Patent
LigandPNGBDBM382320(US10273244, Example 201 | US10584135, Example 201)
Affinity DataKi:  724nM. Assay description: Functional Calcium Assay at hD2 recombinant receptor. CHO cells stably expressing human dopamine receptor type 2, long variant (hD2L), coupled to G&#...
Ligand InfoPC cidPC sid
In DepthDetails US Patent