BDBM382356 US10273259, Example 69::US10711020, Example 69
SMILES OC1(CCS(=O)(=O)CC1)C(=O)N1CC[C@@]2([C@H]1CCc1cc(ccc21)C(F)(C(F)(F)F)C(F)(F)F)S(=O)(=O)c1ccc(F)cc1
InChI Key InChIKey=ONXFNBOZJKXCNC-ZJSXRUAMSA-N
Data  13 IC50  13 EC50
  Tab Delimited (TSV)   2D SDfile   Computed 3D by Vconf -m prep SDfile
Find this compound or compounds like it in BindingDB:
Activity Spreadsheet -- Enzyme Inhibition Constant Data from BindingDB
Found 26 hits for monomerid = 382356
TargetNuclear receptor ROR-gamma(Mus musculus)
Bristol-Myers Squibb
US Patent
LigandPNGBDBM382356(US10273259, Example 69 | US10711020, Example 69)
Affinity DataIC50:  36nM. Assay description: The binding of potential ligands to RORγ is measured by competition with [3H]25-hydroxycholesterol (Perkin Elmer NET674250UC) using a scintillat...
Ligand InfoPC cidPC sid
In DepthDetails US Patent
TargetNuclear receptor ROR-gamma(Homo sapiens (Human))
Bristol Myers Squibb
Curated by ChEMBL
LigandPNGBDBM382356(US10273259, Example 69 | US10711020, Example 69)
Affinity DataEC50:  43nM. Assay description: Inverse agonist activity at RORgammat in human whole blood assessed as inhibition of anti-CD3/anti-CD28 monoclonal antibodies-stimulated IL-17A produ...
Ligand InfoPC cidPC sid
In DepthDetails ArticlePubMed
TargetNuclear receptor ROR-gamma(Mus musculus)
Bristol-Myers Squibb
US Patent
LigandPNGBDBM382356(US10273259, Example 69 | US10711020, Example 69)
Affinity DataEC50:  13nM. Assay description: Inverse agonist activity at RORgammat in mouse cells by mTh17 assay
Ligand InfoPC cidPC sid
In DepthDetails ArticlePubMed
TargetNuclear receptor ROR-alpha(Homo sapiens (Human))
Bristol-Myers Squibb
Curated by ChEMBL
LigandPNGBDBM382356(US10273259, Example 69 | US10711020, Example 69)
Affinity DataEC50: >1.00E+4nM. Assay description: Agonist activity at RORalpha (unknown origin) by Gal4-Luc reporter gene assay
Ligand InfoPC cidPC sid
In DepthDetails ArticlePubMed
TargetNuclear receptor ROR-beta(Homo sapiens (Human))
Bristol-Myers Squibb
Curated by ChEMBL
LigandPNGBDBM382356(US10273259, Example 69 | US10711020, Example 69)
Affinity DataEC50: >1.00E+4nM. Assay description: Agonist activity at RORbeta (unknown origin) by Gal4-Luc reporter gene assay
Ligand InfoPC cidPC sid
In DepthDetails ArticlePubMed
TargetOxysterols receptor LXR-beta(Homo sapiens (Human))
Bristol-Myers Squibb
Curated by ChEMBL
LigandPNGBDBM382356(US10273259, Example 69 | US10711020, Example 69)
Affinity DataEC50: >7.50E+3nM. Assay description: Agonist activity at LXRbeta (unknown origin) by Gal4-Luc reporter gene assay
Ligand InfoPC cidPC sid
In DepthDetails ArticlePubMed
TargetCytochrome P450 1A2(Homo sapiens (Human))
Bristol-Myers Squibb
Curated by ChEMBL
LigandPNGBDBM382356(US10273259, Example 69 | US10711020, Example 69)
Affinity DataIC50: >2.00E+4nM. Assay description: Inhibition of recombinant CYP1A2 (unknown origin)
Ligand InfoPC cidPC sid
In DepthDetails ArticlePubMed
TargetCytochrome P450 2C8(Homo sapiens (Human))
Bristol-Myers Squibb
Curated by ChEMBL
LigandPNGBDBM382356(US10273259, Example 69 | US10711020, Example 69)
Affinity DataIC50:  1.50E+4nM. Assay description: Inhibition of recombinant CYP2C8 (unknown origin)
Ligand InfoPC cidPC sid
In DepthDetails ArticlePubMed
TargetCytochrome P450 2D6(Homo sapiens (Human))
Bristol-Myers Squibb
Curated by ChEMBL
LigandPNGBDBM382356(US10273259, Example 69 | US10711020, Example 69)
Affinity DataIC50: >2.00E+4nM. Assay description: Inhibition of recombinant CYP2D6 (unknown origin)
Ligand InfoPC cidPC sid
In DepthDetails ArticlePubMed
TargetCytochrome P450 3A4(Homo sapiens (Human))
Bristol-Myers Squibb
Curated by ChEMBL
LigandPNGBDBM382356(US10273259, Example 69 | US10711020, Example 69)
Affinity DataIC50: >2.00E+4nM. Assay description: Inhibition of recombinant CYP3A4 (unknown origin) using BFC substrate
Ligand InfoPC cidPC sid
In DepthDetails ArticlePubMed
TargetNuclear receptor ROR-gamma(Homo sapiens (Human))
Bristol Myers Squibb
Curated by ChEMBL
LigandPNGBDBM382356(US10273259, Example 69 | US10711020, Example 69)
Affinity DataEC50:  24nM. Assay description: Inverse agonist activity at full length human RORgammat expressed in human Jurkat cells assessed as inhibition of constitutive receptor activity incu...
Ligand InfoPC cidPC sid
In DepthDetails ArticlePubMed
TargetNuclear receptor subfamily 1 group I member 2(Homo sapiens (Human))
Bristol-Myers Squibb
Curated by ChEMBL
LigandPNGBDBM382356(US10273259, Example 69 | US10711020, Example 69)
Affinity DataIC50: >4.00E+4nM. Assay description: Activity at PXR (unknown origin)
Ligand InfoPC cidPC sid
In DepthDetails ArticlePubMed
TargetOxysterols receptor LXR-beta(Homo sapiens (Human))
Bristol-Myers Squibb
Curated by ChEMBL
LigandPNGBDBM382356(US10273259, Example 69 | US10711020, Example 69)
Affinity DataIC50: >1.00E+4nM. Assay description: Activity at LXRbeta (unknown origin)
Ligand InfoPC cidPC sid
In DepthDetails ArticlePubMed
TargetOxysterols receptor LXR-alpha(Homo sapiens (Human))
Bristol-Myers Squibb
Curated by ChEMBL
LigandPNGBDBM382356(US10273259, Example 69 | US10711020, Example 69)
Affinity DataEC50: >7.50E+3nM. Assay description: Agonist activity at LXRalpha (unknown origin) by Gal4-Luc reporter gene assay
Ligand InfoPC cidPC sid
In DepthDetails ArticlePubMed
TargetNuclear receptor ROR-beta(Homo sapiens (Human))
Bristol-Myers Squibb
Curated by ChEMBL
LigandPNGBDBM382356(US10273259, Example 69 | US10711020, Example 69)
Affinity DataIC50: >1.00E+4nM. Assay description: Activity at RORbeta (unknown origin)
Ligand InfoPC cidPC sid
In DepthDetails ArticlePubMed
TargetOxysterols receptor LXR-alpha(Homo sapiens (Human))
Bristol-Myers Squibb
Curated by ChEMBL
LigandPNGBDBM382356(US10273259, Example 69 | US10711020, Example 69)
Affinity DataIC50: >1.00E+4nM. Assay description: Activity at LXRalpha (unknown origin)
Ligand InfoPC cidPC sid
In DepthDetails ArticlePubMed
TargetNuclear receptor subfamily 1 group I member 2(Homo sapiens (Human))
Bristol-Myers Squibb
Curated by ChEMBL
LigandPNGBDBM382356(US10273259, Example 69 | US10711020, Example 69)
Affinity DataEC50: >5.00E+4nM. Assay description: Agonist activity at PXR (unknown origin) by Gal4-Luc reporter gene assay)
Ligand InfoPC cidPC sid
In DepthDetails ArticlePubMed
TargetCytochrome P450 2C19(Homo sapiens (Human))
Bristol-Myers Squibb
Curated by ChEMBL
LigandPNGBDBM382356(US10273259, Example 69 | US10711020, Example 69)
Affinity DataIC50: >2.00E+4nM. Assay description: Inhibition of recombinant CYP2C19 (unknown origin)
Ligand InfoPC cidPC sid
In DepthDetails ArticlePubMed
TargetNuclear receptor ROR-gamma(Mus musculus)
Bristol-Myers Squibb
US Patent
LigandPNGBDBM382356(US10273259, Example 69 | US10711020, Example 69)
Affinity DataEC50:  440nM. Assay description: Inverse agonist activity at RORgammat in CD3/CD28/IL-1/IL-23-stimulated C57/B6 mouse whole blood assessed as reduction in IL17A production incubated ...
Ligand InfoPC cidPC sid
In DepthDetails ArticlePubMed
TargetCytochrome P450 2C9(Homo sapiens (Human))
Bristol-Myers Squibb
Curated by ChEMBL
LigandPNGBDBM382356(US10273259, Example 69 | US10711020, Example 69)
Affinity DataIC50:  1.00E+4nM. Assay description: Inhibition of recombinant CYP2C9 (unknown origin)
Ligand InfoPC cidPC sid
In DepthDetails ArticlePubMed
TargetNuclear receptor ROR-alpha(Homo sapiens (Human))
Bristol-Myers Squibb
Curated by ChEMBL
LigandPNGBDBM382356(US10273259, Example 69 | US10711020, Example 69)
Affinity DataIC50: >1.00E+4nM. Assay description: Activity at RORalpha (unknown origin)
Ligand InfoPC cidPC sid
In DepthDetails ArticlePubMed
TargetNuclear receptor ROR-gamma(Homo sapiens (Human))
Bristol Myers Squibb
Curated by ChEMBL
LigandPNGBDBM382356(US10273259, Example 69 | US10711020, Example 69)
Affinity DataEC50:  43nM. Assay description: Inverse agonist activity at RORgammat in CD3 and CD28-stimulated human whole blood assessed as reduction in IL17A production incubated for 1 hr befor...
Ligand InfoPC cidPC sid
In DepthDetails ArticlePubMed
TargetNuclear receptor ROR-gamma(Homo sapiens (Human))
Bristol Myers Squibb
Curated by ChEMBL
LigandPNGBDBM382356(US10273259, Example 69 | US10711020, Example 69)
Affinity DataEC50:  24nM. Assay description: Inverse agonist activity at human Gal4-fused RORgammat expressed in human Jurkat cells assessed as inhibition of constitutive receptor activity measu...
Ligand InfoPC cidPC sid
In DepthDetails ArticlePubMed
TargetNuclear receptor ROR-gamma(Homo sapiens (Human))
Bristol Myers Squibb
Curated by ChEMBL
LigandPNGBDBM382356(US10273259, Example 69 | US10711020, Example 69)
Affinity DataEC50:  43nM. Assay description: Inverse agonist activity at RORgammat in CD3 and CD28-stimulated human whole blood assessed as suppression of IL17 incubated for 1 hr before CD3 and ...
Ligand InfoPC cidPC sid
In DepthDetails ArticlePubMed
TargetNuclear receptor ROR-gamma(Homo sapiens (Human))
Bristol Myers Squibb
Curated by ChEMBL
LigandPNGBDBM382356(US10273259, Example 69 | US10711020, Example 69)
Affinity DataEC50:  24nM. Assay description: Inverse agonist activity at human Gal4-fused RORgammat expressed in human Jurkat cells luciferase reporter gene assay
Ligand InfoPC cidPC sid
In DepthDetails ArticlePubMed
TargetNuclear receptor ROR-gamma [262-507](Homo sapiens (Human))
Bristol-Myers Squibb
US Patent
LigandPNGBDBM382356(US10273259, Example 69 | US10711020, Example 69)
Affinity DataIC50:  36nM. Assay description: The binding of potential ligands to RORγ is measured by competition with [3H]25-hydroxycholesterol (Perkin Elmer NET674250UC) using a scintillat...
Ligand InfoPC cidPC sid
In DepthDetails US Patent