BDBM38280 1-(3-Diethylamino-propyl)-1-(7-oxo-2,3,6,7-tetrahydro-[1,4]dioxino[2,3-g]quinolin-8-ylmethyl)-3-phenyl-urea::1-[3-(diethylamino)propyl]-1-[(7-keto-3,6-dihydro-2H-[1,4]dioxino[2,3-g]quinolin-8-yl)methyl]-3-phenyl-urea::1-[3-(diethylamino)propyl]-1-[(7-oxidanylidene-3,6-dihydro-2H-[1,4]dioxino[2,3-g]quinolin-8-yl)methyl]-3-phenyl-urea::1-[3-(diethylamino)propyl]-1-[(7-oxo-3,6-dihydro-2H-[1,4]dioxino[2,3-g]quinolin-8-yl)methyl]-3-phenylurea::MLS000072863::SMR000004152::cid_650323
SMILES CCN(CC)CCCN(Cc1cc2cc3OCCOc3cc2[nH]c1=O)C(=O)Nc1ccccc1
InChI Key InChIKey=CVFQTODNXGGXKJ-UHFFFAOYSA-N
Data  3 IC50
  Tab Delimited (TSV)   2D SDfile   Computed 3D by Vconf -m prep SDfile
Find this compound or compounds like it in BindingDB:
Activity Spreadsheet -- Enzyme Inhibition Constant Data from BindingDB
Found 3 hits for monomerid = 38280
TargetDiphosphomevalonate decarboxylase(Streptococcus pneumoniae D39)
Srmlsc
Curated by PubChem BioAssay
LigandPNGBDBM38280(1-(3-Diethylamino-propyl)-1-(7-oxo-2,3,6,7-tetrahy...)
Affinity DataIC50: >1.00E+7nM. Assay description: Southern Research Molecular Libraries Screening Center (SRMLSC) Southern Research Institute (Birmingham, Alabama) NIH Molecular Libraries Screening C...
In DepthDetails PCBioAssay
TargetEphrin type-A receptor 4(Mus musculus)
Burnham Center For Chemical Genomics
Curated by PubChem BioAssay
LigandPNGBDBM38280(1-(3-Diethylamino-propyl)-1-(7-oxo-2,3,6,7-tetrahy...)
Affinity DataIC50: >5.00E+4nM. Assay description: Sanford-Burnham Center for Chemical Genomics (SBCCG) Sanford-Burnham Medical Research Institute (SBMRI, San Diego, CA) NIH Molecular Libraries Screen...
In DepthDetails PCBioAssay
TargetEphrin type-A receptor 4(Mus musculus)
Burnham Center For Chemical Genomics
Curated by PubChem BioAssay
LigandPNGBDBM38280(1-(3-Diethylamino-propyl)-1-(7-oxo-2,3,6,7-tetrahy...)
Affinity DataIC50:  1.33E+4nM. Assay description: Data Source: Sanford-Burnham Center for Chemical Genomics (SBCCG) Source Affiliation: Sanford-Burnham Medical Research Institute (SBMRI, San Diego, C...
In DepthDetails PCBioAssay