BDBM383189 US10278968, Compound 717::US10793535, Cmpd ID 717
SMILES COc1ccc(OC(F)(F)F)cc1CC(=O)Nc1ccc(CCCCc2nnc(NC(=O)Cc3ccccn3)s2)nn1
InChI Key InChIKey=ZDIISWUXPDGWSE-UHFFFAOYSA-N
Data  2 IC50
  Tab Delimited (TSV)   2D SDfile   Computed 3D by Vconf -m prep SDfile
Find this compound or compounds like it in BindingDB:
Activity Spreadsheet -- Enzyme Inhibition Constant Data from BindingDB
Found 2 hits for monomerid = 383189
TargetGlutamate dehydrogenase 2, mitochondrial(Human)
Calithera Biosciences
US Patent
LigandPNGBDBM383189(US10278968, Compound 717 | US10793535, Cmpd ID 717)
Affinity DataIC50:  34nM. Assay description: Glutaminase reaction buffer was prepared [50 mM Tris-HCl pH 8.8, 150 mM K2HPO4, 0.25 mM EDTA, 0.1 mg/ml BSA (Calbiochem no. 2960), 1 mM DTT, 2 mM NAD...
Ligand InfoPC cidPC sid
In DepthDetails US Patent
TargetGlutaminase kidney isoform, mitochondrial(Homo sapiens (Human))
Calithera Biosciences
US Patent
LigandPNGBDBM383189(US10278968, Compound 717 | US10793535, Cmpd ID 717)
Affinity DataIC50:  34nM. Assay description: Compounds were assessed for their ability to inhibit the enzymatic activity of a recombinant form of Glutaminase 1 (GAC) using a biochemical assay th...
Ligand InfoPC cidPC sid
In DepthDetails US Patent