BDBM38324 2-[[7-(2-furanylmethyl)-5,6-diphenyl-4-pyrrolo[2,3-d]pyrimidinyl]amino]ethanol::2-[[7-(2-furfuryl)-5,6-diphenyl-pyrrolo[2,3-d]pyrimidin-4-yl]amino]ethanol::2-[[7-(furan-2-ylmethyl)-5,6-diphenyl-pyrrolo[2,3-d]pyrimidin-4-yl]amino]ethanol::2-[[7-(furan-2-ylmethyl)-5,6-diphenylpyrrolo[2,3-d]pyrimidin-4-yl]amino]ethanol::MLS000036876::SMR000034637::cid_661878
SMILES OCCNc1ncnc2n(Cc3ccco3)c(c(-c3ccccc3)c12)-c1ccccc1
InChI Key InChIKey=HJUQKIQEFGKYJC-UHFFFAOYSA-N
Data  2 IC50  1 EC50
  Tab Delimited (TSV)   2D SDfile   Computed 3D by Vconf -m prep SDfile
Find this compound or compounds like it in BindingDB:
Activity Spreadsheet -- Enzyme Inhibition Constant Data from BindingDB
Found 3 hits for monomerid = 38324
TargetDiphosphomevalonate decarboxylase(Streptococcus pneumoniae D39)
Srmlsc
Curated by PubChem BioAssay
LigandPNGBDBM38324(2-[[7-(2-furanylmethyl)-5,6-diphenyl-4-pyrrolo[2,3...)
Affinity DataIC50: >1.00E+7nM. Assay description: Southern Research Molecular Libraries Screening Center (SRMLSC) Southern Research Institute (Birmingham, Alabama) NIH Molecular Libraries Screening C...
In DepthDetails PCBioAssay
TargetTyrosine-protein phosphatase non-receptor type 7(Homo sapiens (Human))
Burnham Center For Chemical Genomics
Curated by PubChem BioAssay
LigandPNGBDBM38324(2-[[7-(2-furanylmethyl)-5,6-diphenyl-4-pyrrolo[2,3...)
Affinity DataIC50:  1.00E+5nM. Assay description: Data Source: Sanford-Burnham Center for Chemical Genomics (SBCCG) Source Affiliation: Sanford-Burnham Medical Research Institute (SBMRI, San Diego, C...
In DepthDetails PCBioAssay
TargetD(1A) dopamine receptor(Homo sapiens (Human))
Vanderbilt Screening Center For Gpcrs, Ion Channels And Transporters
Curated by PubChem BioAssay
LigandPNGBDBM38324(2-[[7-(2-furanylmethyl)-5,6-diphenyl-4-pyrrolo[2,3...)
Affinity DataEC50:  0.00424nM. Assay description: Assay Provider: Val Watts Assay Provider Affiliation: Purdue University Grant Title: Allosteric Modulators of D1 Receptors Grant Number: 1 X01 MH0776...
In DepthDetails PCBioAssay