BDBM383276 4-(3-(3-fluoro-4- methoxybenzyl)-3,4-dihydro- 5-oxa-1,2,2a1- triazaacenaphthylen-7-yl)-N- (1-methyl-1H-pyrazol-5- yl)pyrimidin-2-amine::US10278975, Compound I-46 R::US11376260, Example I-46R
SMILES COc1ccc(C[C@H]2COc3cc(cc4nnc2n34)-c2ccnc(Nc3ccnn3C)n2)cc1F
InChI Key InChIKey=UBFJRUBIZJZSQZ-INIZCTEOSA-N
Data  2 IC50
  Tab Delimited (TSV)   2D SDfile   Computed 3D by Vconf -m prep SDfile
Find this compound or compounds like it in BindingDB:
Activity Spreadsheet -- Enzyme Inhibition Constant Data from BindingDB
Found 2 hits for monomerid = 383276
TargetMitogen-activated protein kinase 6(Homo sapiens (Human))
Genentech
US Patent
LigandPNGBDBM383276(4-(3-(3-fluoro-4- methoxybenzyl)-3,4-dihydro- 5-ox...)
Affinity DataIC50: <0.0200nM. Assay description: Compounds were tested in an enzymatic assay using human ERK-2 (Mitogen Activated Kinase 1), recombinantly expressed as an n-terminal 6-His fusion pro...
Ligand InfoPC cidPC sid
In DepthDetails US Patent
TargetMitogen-activated protein kinase 1(Homo sapiens (Human))
Genentech
US Patent
LigandPNGBDBM383276(4-(3-(3-fluoro-4- methoxybenzyl)-3,4-dihydro- 5-ox...)
Affinity DataIC50: <0.0200nM. Assay description: Compounds were tested in an enzymatic assay using human ERK-2 (Mitogen Activated Kinase 1), recombinantly expressed as an n-terminal 6-His fusion pro...
Ligand InfoPC cidPC sid
In DepthDetails US Patent