BDBM383555 (1-cyclobutyl-3-piperidyl)-[4-(1-hydroxyethyl)-2-naphthyl]methanone::US10280149, Example 64
SMILES CC(O)c1cc(cc2ccccc12)C(=O)C1CCCN(C1)C1CCC1
InChI Key InChIKey=XGVDRJHXDLBNLU-UHFFFAOYSA-N
Data  1 IC50
  Tab Delimited (TSV)   2D SDfile   Computed 3D by Vconf -m prep SDfile
Find this compound or compounds like it in BindingDB:
Activity Spreadsheet -- Enzyme Inhibition Constant Data from BindingDB
Found 1 hit for monomerid = 383555
TargetLysine-specific demethylase 2B(Homo sapiens (Human))
Genentech
US Patent
LigandPNGBDBM383555((1-cyclobutyl-3-piperidyl)-[4-(1-hydroxyethyl)-2-n...)
Affinity DataIC50:  43.8nM. Assay description: Full length KDM2B was cloned, expressed, and purified to homogeneity. Compound inhibition of KDM2B demethylase activity was assessed by monitoring th...
Ligand InfoPC cidPC sid
In DepthDetails US Patent