BDBM383890 US10280150, Cmpd No I-173::US10550099, Compound I-173
SMILES CC(C)n1cncc1-c1ccnc(N[C@@H](C)c2cc3cc(Cl)ccc3n(C)c2=O)n1
InChI Key InChIKey=GFUUTRABMIWYGA-AWEZNQCLSA-N
Data  4 IC50
  Tab Delimited (TSV)   2D SDfile   Computed 3D by Vconf -m prep SDfile
Find this compound or compounds like it in BindingDB:
Activity Spreadsheet -- Enzyme Inhibition Constant Data from BindingDB
Found 4 hits for monomerid = 383890
TargetIsocitrate dehydrogenase [NADP] cytoplasmic [R132H](Homo sapiens (Human))
Forma Tm2
US Patent
LigandPNGBDBM383890(US10280150, Cmpd No I-173 | US10550099, Compound I...)
Affinity DataIC50: <100nM. Assay description: Assays were performed in a 384-well black plate. An aliquot of 250 nL of compound was incubated with 10 μL of 30 nM IDH1-R132H or 10 nM IDH1-R13...
Ligand InfoPC cidPC sid
In DepthDetails US Patent
TargetIsocitrate dehydrogenase [NADP] cytoplasmic [R132C](Homo sapiens (Human))
Forma Therapeutics
US Patent
LigandPNGBDBM383890(US10280150, Cmpd No I-173 | US10550099, Compound I...)
Affinity DataIC50: <100nM. Assay description: Assays were performed in a 384-well black plate. An aliquot of 250 nL of compound was incubated with 10 μL of 30 nM IDH1-R132H or 10 nM IDH1-R13...
Ligand InfoPC cidPC sid
In DepthDetails US Patent
TargetIsocitrate dehydrogenase [NADP] cytoplasmic [R132H](Homo sapiens (Human))
Forma Tm2
US Patent
LigandPNGBDBM383890(US10280150, Cmpd No I-173 | US10550099, Compound I...)
Affinity DataIC50: <100nM. Assay description: Assays were performed in a 384-well black plate. An aliquot of 250 nL of compound was incubated with 10 μL of 30 nM IDH1-R132H or 10 nM IDH1-R13...
Ligand InfoPC cidPC sid
In DepthDetails US Patent
TargetIsocitrate dehydrogenase [NADP] cytoplasmic [R132C](Homo sapiens (Human))
Forma Therapeutics
US Patent
LigandPNGBDBM383890(US10280150, Cmpd No I-173 | US10550099, Compound I...)
Affinity DataIC50: <100nM. Assay description: Assays were performed in a 384-well black plate. An aliquot of 250 nL of compound was incubated with 10 μL of 30 nM IDH1-R132H or 10 nM IDH1-R13...
Ligand InfoPC cidPC sid
In DepthDetails US Patent