BDBM383969 US10280166, Compound 71
SMILES Fc1ccccc1-c1ccnc2[nH]c(nc12)-c1n[nH]c2ccc(cc12)-c1cncc(NC(=O)C2CC2)c1
InChI Key InChIKey=FBJMZBYOARNCIA-RFBIWTDZSA-N
Data  1 IC50
  Tab Delimited (TSV)   2D SDfile   Computed 3D by Vconf -m prep SDfile
Find this compound or compounds like it in BindingDB:
Activity Spreadsheet -- Enzyme Inhibition Constant Data from BindingDB
Found 1 hit for monomerid = 383969
TargetProto-oncogene Wnt-1(Homo sapiens (human))
Samumed
US Patent
LigandPNGBDBM383969(US10280166, Compound 71)
Affinity DataIC50:  11.1nM. Assay description: Reporter cell lines can be generated by stably transducing cancer cell lines (e.g., colon cancer) or primary cells (e.g., IEC-6 intestinal cells) wit...
Ligand InfoPC cidPC sid
In DepthDetails US Patent