BDBM384000 US10280166, Compound 239
SMILES Cc1ccncc1-c1ccc2[nH]nc(-c3nc4cccnc4[nH]3)c2c1
InChI Key InChIKey=IDJHHORLSIMSOT-ZPHPHTNESA-N
Data  1 IC50
  Tab Delimited (TSV)   2D SDfile   Computed 3D by Vconf -m prep SDfile
Find this compound or compounds like it in BindingDB:
Activity Spreadsheet -- Enzyme Inhibition Constant Data from BindingDB
Found 1 hit for monomerid = 384000
TargetProto-oncogene Wnt-1(Homo sapiens (human))
Samumed
US Patent
LigandPNGBDBM384000(US10280166, Compound 239)
Affinity DataIC50:  4.10E+3nM. Assay description: Reporter cell lines can be generated by stably transducing cancer cell lines (e.g., colon cancer) or primary cells (e.g., IEC-6 intestinal cells) wit...
Ligand InfoPC cidPC sid
In DepthDetails US Patent