BDBM384039 US10280166, Compound 433
SMILES CCCC(=O)Nc1cncc(c1)-c1ccc2[nH]nc(-c3nc4c(ccnc4[nH]3)-c3cc(F)cc(CNS(C)(=O)=O)c3)c2c1
InChI Key InChIKey=FTXRHEUHAJPIKW-HYOGKJQXSA-N
Data  1 IC50
  Tab Delimited (TSV)   2D SDfile   Computed 3D by Vconf -m prep SDfile
Find this compound or compounds like it in BindingDB:
Activity Spreadsheet -- Enzyme Inhibition Constant Data from BindingDB
Found 1 hit for monomerid = 384039
TargetProto-oncogene Wnt-1(Homo sapiens (human))
Samumed
US Patent
LigandPNGBDBM384039(US10280166, Compound 433)
Affinity DataIC50:  3nM. Assay description: Reporter cell lines can be generated by stably transducing cancer cell lines (e.g., colon cancer) or primary cells (e.g., IEC-6 intestinal cells) wit...
Ligand InfoPC cidPC sid
In DepthDetails US Patent