BDBM384040 US10280166, Compound 439
SMILES CS(=O)(=O)NCc1cc(F)cc(c1)-c1ccnc2[nH]c(nc12)-c1n[nH]c2ccc(cc12)-c1cncc(CNCc2ccccc2)c1
InChI Key InChIKey=FYLIPVLFYWZMHB-YJKCNMNRSA-N
Data  1 IC50
  Tab Delimited (TSV)   2D SDfile   Computed 3D by Vconf -m prep SDfile
Find this compound or compounds like it in BindingDB:
Activity Spreadsheet -- Enzyme Inhibition Constant Data from BindingDB
Found 1 hit for monomerid = 384040
TargetProto-oncogene Wnt-1(Homo sapiens (human))
Samumed
US Patent
LigandPNGBDBM384040(US10280166, Compound 439)
Affinity DataIC50:  354nM. Assay description: Reporter cell lines can be generated by stably transducing cancer cell lines (e.g., colon cancer) or primary cells (e.g., IEC-6 intestinal cells) wit...
Ligand InfoPC cidPC sid
In DepthDetails US Patent