BDBM384062 US10280166, Compound 1880
SMILES Fc1cccc(c1)-c1ccnc2[nH]c(nc12)-c1n[nH]c2ccc(cc12)-c1cncc(OC2CCNCC2)c1
InChI Key InChIKey=GWDWRYDVNYTWKJ-OHYPFYFLSA-N
Data  1 IC50
  Tab Delimited (TSV)   2D SDfile   Computed 3D by Vconf -m prep SDfile
Find this compound or compounds like it in BindingDB:
Activity Spreadsheet -- Enzyme Inhibition Constant Data from BindingDB
Found 1 hit for monomerid = 384062
TargetProto-oncogene Wnt-1(Homo sapiens (human))
Samumed
US Patent
LigandPNGBDBM384062(US10280166, Compound 1880)
Affinity DataIC50:  1.19E+3nM. Assay description: Reporter cell lines can be generated by stably transducing cancer cell lines (e.g., colon cancer) or primary cells (e.g., IEC-6 intestinal cells) wit...
Ligand InfoPC cidPC sid
In DepthDetails US Patent