BDBM384085 US10280167, Example 8
SMILES Cc1c[nH]c(n1)-c1nc(N)c2[nH]c(=O)n(Cc3ccccc3)c2n1
InChI Key InChIKey=XGUAHFYYZFDVHR-BUHFOSPRSA-N
Data  1 EC50
  Tab Delimited (TSV)   2D SDfile   Computed 3D by Vconf -m prep SDfile
Find this compound or compounds like it in BindingDB:
Activity Spreadsheet -- Enzyme Inhibition Constant Data from BindingDB
Found 1 hit for monomerid = 384085
TargetRNA-directed RNA polymerase(Hepatitis C virus)
Janssen Ireland
US Patent
LigandPNGBDBM384085(US10280167, Example 8)
Affinity DataEC50:  170nM. Assay description: Activation of human TLR7 results in robust production of interferon by plasmacytoid dendritic cells present in human blood. The potential of compound...
Ligand InfoPC cidPC sid
In DepthDetails US Patent