BDBM384086 US10280167, Example 9
SMILES Cc1ccc(Cn2c3nc(nc(N)c3[nH]c2=O)-c2ncc[nH]2)cn1
InChI Key InChIKey=NTOAUFGBUZINEK-UHFFFAOYSA-N
Data  1 EC50
  Tab Delimited (TSV)   2D SDfile   Computed 3D by Vconf -m prep SDfile
Find this compound or compounds like it in BindingDB:
Activity Spreadsheet -- Enzyme Inhibition Constant Data from BindingDB
Found 1 hit for monomerid = 384086
TargetRNA-directed RNA polymerase(Hepatitis C virus)
Janssen Ireland
US Patent
LigandPNGBDBM384086(US10280167, Example 9)
Affinity DataEC50:  50nM. Assay description: Activation of human TLR7 results in robust production of interferon by plasmacytoid dendritic cells present in human blood. The potential of compound...
Ligand InfoPC cidPC sid
In DepthDetails US Patent