BDBM38414 3-(3-methoxypropyl)-6-(4-morpholinyl)-2-sulfanylidene-1H-quinazolin-4-one::3-(3-methoxypropyl)-6-morpholin-4-yl-2-sulfanylidene-1H-quinazolin-4-one::3-(3-methoxypropyl)-6-morpholin-4-yl-2-thioxo-2,3-dihydroquinazolin-4(1H)-one::3-(3-methoxypropyl)-6-morpholino-2-thioxo-1H-quinazolin-4-one::MLS000095418::SMR000030972::cid_3241066
SMILES COCCCn1c(=S)[nH]c2ccc(cc2c1=O)N1CCOCC1
InChI Key InChIKey=RWCLZXWMZVFDKG-UHFFFAOYSA-N
Data  1 IC50
  Tab Delimited (TSV)   2D SDfile   Computed 3D by Vconf -m prep SDfile
Find this compound or compounds like it in BindingDB:
Activity Spreadsheet -- Enzyme Inhibition Constant Data from BindingDB
Found 1 hit for monomerid = 38414
TargetDiphosphomevalonate decarboxylase(Streptococcus pneumoniae D39)
Srmlsc
Curated by PubChem BioAssay
LigandPNGBDBM38414(3-(3-methoxypropyl)-6-(4-morpholinyl)-2-sulfanylid...)
Affinity DataIC50:  2.67E+4nM. Assay description: Southern Research Molecular Libraries Screening Center (SRMLSC) Southern Research Institute (Birmingham, Alabama) NIH Molecular Libraries Screening C...
In DepthDetails PCBioAssay