BDBM384218 US10280184, Example A.1.2
SMILES C1CCC(CC1)c1cn2ncnc2c(Nc2cnn(c2)C2CCOCC2)n1
InChI Key InChIKey=LGHPHYPVQREZIS-UHFFFAOYSA-N
Data  1 IC50
  Tab Delimited (TSV)   2D SDfile   Computed 3D by Vconf -m prep SDfile
Find this compound or compounds like it in BindingDB:
Activity Spreadsheet -- Enzyme Inhibition Constant Data from BindingDB
Found 1 hit for monomerid = 384218
TargetMacrophage colony-stimulating factor 1 receptor(Homo sapiens (Human))
Abbvie
US Patent
LigandPNGBDBM384218(US10280184, Example A.1.2)
Affinity DataIC50: <100nM. Assay description: The CSF-1R construct corresponds to recombinant human catalytic domain (aa 538-910), which was purchased from Invitrogen (cat #PV4092). CSF-1R was mi...
Ligand InfoPC cidPC sid
In DepthDetails US Patent