BDBM384220 US10280184, Example A.1.4
SMILES C1OCC1n1cc(Nc2nc(cn3ncnc23)C2CCCCC2)cn1
InChI Key InChIKey=LEUOERVYWZCHKP-UHFFFAOYSA-N
Data  1 IC50
  Tab Delimited (TSV)   2D SDfile   Computed 3D by Vconf -m prep SDfile
Find this compound or compounds like it in BindingDB:
Activity Spreadsheet -- Enzyme Inhibition Constant Data from BindingDB
Found 1 hit for monomerid = 384220
TargetMacrophage colony-stimulating factor 1 receptor(Homo sapiens (Human))
Abbvie
US Patent
LigandPNGBDBM384220(US10280184, Example A.1.4)
Affinity DataIC50: <100nM. Assay description: The CSF-1R construct corresponds to recombinant human catalytic domain (aa 538-910), which was purchased from Invitrogen (cat #PV4092). CSF-1R was mi...
Ligand InfoPC cidPC sid
In DepthDetails US Patent