BDBM384239 US10280184, Example F.1.2
SMILES C=CC(=O)Nc1cccc(c1)-c1cn2ncnc2c(NC23CC(C2)C3)n1
InChI Key InChIKey=CWTBAUYRKLZRON-UHFFFAOYSA-N
Data  1 IC50
  Tab Delimited (TSV)   2D SDfile   Computed 3D by Vconf -m prep SDfile
Find this compound or compounds like it in BindingDB:
Activity Spreadsheet -- Enzyme Inhibition Constant Data from BindingDB
Found 1 hit for monomerid = 384239
TargetTyrosine-protein kinase BTK(Homo sapiens (Human))
Abbvie
US Patent
LigandPNGBDBM384239(US10280184, Example F.1.2)
Affinity DataIC50:  550nM. Assay description: The in-house BTK corresponds to recombinant human catalytic domain (aa 393-659), which was expressed in SF9 cells with an N-terminal his tag and puri...
Ligand InfoPC cidPC sid
In DepthDetails US Patent