BDBM384314 US10590114, No. 17::US11111235, No. 17::US11591316, Compound 17::US9932325, Example 17
SMILES CNc1nc(Nc2cnn3CC4(CC4)COc23)ncc1C(F)(F)F
InChI Key InChIKey=GDWGPIFYTLWBOA-UHFFFAOYSA-N
Data  4 IC50
  Tab Delimited (TSV)   2D SDfile   Computed 3D by Vconf -m prep SDfile
Find this compound or compounds like it in BindingDB:
Activity Spreadsheet -- Enzyme Inhibition Constant Data from BindingDB
Found 4 hits for monomerid = 384314
TargetLeucine-rich repeat serine/threonine-protein kinase 2 [G2019S](Homo sapiens (Human))
Denali Therapeutics
US Patent
LigandPNGBDBM384314(US10590114, No. 17 | US11111235, No. 17 | US115913...)
Affinity DataIC50: <30nM. Assay description: Materials: LRRK2 G2019S enzyme Substrate (LRRKtide) ATP TR-FRET dilution buffer pLRRKtide antibody 384-well...
Ligand InfoPC cidPC sid
In DepthDetails US Patent
TargetLeucine-rich repeat serine/threonine-protein kinase 2 [G2019S](Homo sapiens (Human))
Denali Therapeutics
US Patent
LigandPNGBDBM384314(US10590114, No. 17 | US11111235, No. 17 | US115913...)
Affinity DataIC50: <30nM. Assay description: Compounds were prepared by initially diluting to 1 mM with DMSO. 35 μL of reference compound solution, 35 μL of test compound solution, and...
Ligand InfoPC cidPC sid
In DepthDetails US Patent
TargetLeucine-rich repeat serine/threonine-protein kinase 2 [G2019S](Homo sapiens (Human))
Denali Therapeutics
US Patent
LigandPNGBDBM384314(US10590114, No. 17 | US11111235, No. 17 | US115913...)
Affinity DataIC50: <30nM. Assay description: Materials:LRRK2 G2019S enzymeSubstrate (LRRKtide)ATPTR-FRET dilution bufferpLRRKtide antibody384-well assay plateDMSOEnzyme Reaction Conditions50 mM ...
Ligand InfoPC cidPC sid
In DepthDetails US Patent
TargetLeucine-rich repeat serine/threonine-protein kinase 2(Homo sapiens (Human))
Denali Therapautics
US Patent
LigandPNGBDBM384314(US10590114, No. 17 | US11111235, No. 17 | US115913...)
Affinity DataIC50: <30nM. Assay description: Materials: LRRK2 G2019S enzyme Substrate (LRRKtide) ATP TR-FRET dilution buffer pLRRKtide antibody 384-well...
Ligand InfoPC cidPC sid
In DepthDetails US Patent