BDBM384348 Trans-2-((4-(6-fluoro-2,2-dimethyl-2,3-dihydrobenzofuran-4-yl)phenoxy)methyl) cyclopropanecarboxylic acid (racemate)::US9938222, Example 20
SMILES CC1(C)Cc2c(O1)cc(F)cc2-c1ccc(OCC2CC2C(O)=O)cc1
InChI Key InChIKey=BDGGUSUBJNDZBO-UHFFFAOYSA-N
Data  1 EC50
  Tab Delimited (TSV)   2D SDfile   Computed 3D by Vconf -m prep SDfile
Find this compound or compounds like it in BindingDB:
Activity Spreadsheet -- Enzyme Inhibition Constant Data from BindingDB
Found 1 hit for monomerid = 384348
TargetFree fatty acid receptor 4(Homo sapiens (Human))
Bristol-Myers Squibb
US Patent
LigandPNGBDBM384348(Trans-2-((4-(6-fluoro-2,2-dimethyl-2,3-dihydrobenz...)
Affinity DataEC50:  990nM. Assay description: For the pERK assay, 3×106 cells/mL cryopreserved human and mouse cells were thawed rapidly in a 37° C. water bath and added to a T-225 flask containi...
Ligand InfoPC cidPC sid
In DepthDetails US Patent