BDBM384654 4-{[trans-4-(3- hydroxypyrrolidin-1-yl)- 1- methylcyclohexyl]amino} quinazoline-6-carbonitrile::US9932350, 7-3
SMILES C[C@@]1(CC[C@@H](CC1)N1CCC(O)C1)Nc1ncnc2ccc(cc12)C#N
InChI Key InChIKey=MVGREVIJIUPMKE-UDOXGVECSA-N
Data  1 IC50
  Tab Delimited (TSV)   2D SDfile   Computed 3D by Vconf -m prep SDfile
Find this compound or compounds like it in BindingDB:
Activity Spreadsheet -- Enzyme Inhibition Constant Data from BindingDB
Found 1 hit for monomerid = 384654
TargetInterleukin-1 receptor-associated kinase 4(Homo sapiens (Human))
Merck Sharp & Dohme
US Patent
LigandPNGBDBM384654(4-{[trans-4-(3- hydroxypyrrolidin-1-yl)- 1- methyl...)
Affinity DataIC50:  43nM. Assay description: The kinase activity of IRAK4 is determined by its ability to catalyze the phosphorylation of a fluorescent polypeptide substrate. The extent of phosp...
Ligand InfoPC cidPC sid
In DepthDetails US Patent