BDBM384676 US10285982, Compound 96
SMILES CC(C)Nc1cncc(c1)-c1cc2c(n[nH]c2cn1)-c1cc2c(ccnc2[nH]1)-c1cccnc1
InChI Key InChIKey=QKQAHFLWTFJMAI-BZZOAKBMSA-N
Data  1 EC50
  Tab Delimited (TSV)   2D SDfile   Computed 3D by Vconf -m prep SDfile
Find this compound or compounds like it in BindingDB:
Activity Spreadsheet -- Enzyme Inhibition Constant Data from BindingDB
Found 1 hit for monomerid = 384676
TargetProto-oncogene Wnt-1(Homo sapiens (human))
Samumed
US Patent
LigandPNGBDBM384676(US10285982, Compound 96)
Affinity DataEC50: >1.00E+4nM. Assay description: Reporter cell lines can be generated by stably transducing cancer cell lines (e.g., colon cancer) or primary cells (e.g., IEC-6 intestinal cells) wit...
Ligand InfoPC cidPC sid
In DepthDetails US Patent