BDBM384872 5-(4-((2H-tetrazol-5-yl)methyl)-2-methoxybenzyl)-N4-butyl-6-methylpyrimidine-2,4-diamine ::US10287253, Example 2
SMILES CCCCNc1nc(N)nc(C)c1Cc1ccc(Cc2nn[nH]n2)cc1OC
InChI Key InChIKey=LDPQAUYDAXCRQL-UHFFFAOYSA-N
Data  1 EC50
  Tab Delimited (TSV)   2D SDfile   Computed 3D by Vconf -m prep SDfile
Find this compound or compounds like it in BindingDB:
Activity Spreadsheet -- Enzyme Inhibition Constant Data from BindingDB
Found 1 hit for monomerid = 384872
TargetToll-like receptor 7(Homo sapiens (Human))
Apros Therapeutics
US Patent
LigandPNGBDBM384872(5-(4-((2H-tetrazol-5-yl)methyl)-2-methoxybenzyl)-N...)
Affinity DataEC50:  5.50E+3nM. Assay description: HEK-Blue TLR7 cells were purchased from Invivogen (San Diego, Calif.). The following description was taken from the product information sheet."HEK-Bl...
Ligand InfoPC cidPC sid
In DepthDetails US Patent