BDBM385044 4′-[(2S)-2-Cyano-2-{[(2S)-1,4-oxazepan-2-ylcarbonyl]amino}ethyl]biphenyl-3-yl methanesulfonate::US10287258, Example 4::US10669245, Example 4::US11117874, Example 4::US11667615, Example 4::US11680049, Example 4::US20230278969, Example 4
SMILES CS(=O)(=O)Oc1cccc(c1)-c1ccc(C[C@H](NC(=O)[C@@H]2CNCCCO2)C#N)cc1
InChI Key InChIKey=IRYUDRJLDSHZAO-FPOVZHCZSA-N
Data  7 IC50
  Tab Delimited (TSV)   2D SDfile   Computed 3D by Vconf -m prep SDfile
Find this compound or compounds like it in BindingDB:
Activity Spreadsheet -- Enzyme Inhibition Constant Data from BindingDB
Found 7 hits for monomerid = 385044
TargetDipeptidyl peptidase 1(Homo sapiens (Human))
Astrazeneca
US Patent
LigandPNGBDBM385044(4′-[(2S)-2-Cyano-2-{[(2S)-1,4-oxazepan-2-ylc...)
Affinity DataIC50:  79.4nM. Assay description: The activity of DPP1 was determined by measuring the enzymatic release of aminomethyl coumarin (AMC) from the peptide substrate (H-Gly-Arg-AMC), whic...
Ligand InfoPC cidPC sid
In DepthDetails US Patent
TargetDipeptidyl peptidase 1(Homo sapiens (Human))
Astrazeneca
US Patent
LigandPNGBDBM385044(4′-[(2S)-2-Cyano-2-{[(2S)-1,4-oxazepan-2-ylc...)
Affinity DataIC50:  79.4nM. Assay description: The activity of DPP1 was determined by measuring the enzymatic release of aminomethyl coumarin (AMC) from the peptide substrate (H-Gly-Arg-AMC), whic...
Ligand InfoPC cidPC sid
In DepthDetails US Patent
TargetDipeptidyl peptidase 1(Homo sapiens (Human))
Astrazeneca
US Patent
LigandPNGBDBM385044(4′-[(2S)-2-Cyano-2-{[(2S)-1,4-oxazepan-2-ylc...)
Affinity DataIC50:  79.4nM. Assay description: The activity of DPP1 was determined by measuring the enzymatic release of aminomethyl coumarin (AMC) from the peptide substrate (H-Gly-Arg-AMC), whic...
Ligand InfoPC cidPC sid
In DepthDetails US Patent
TargetDipeptidyl peptidase 1(Homo sapiens (Human))
Astrazeneca
US Patent
LigandPNGBDBM385044(4′-[(2S)-2-Cyano-2-{[(2S)-1,4-oxazepan-2-ylc...)
Affinity DataIC50:  79.4nM. Assay description: The activity of DPP1 was determined by measuring the enzymatic release of amino methyl coumarin (AMC) from the peptide substrate (H-Gly-Arg-AMC), whi...
Ligand InfoPC cidPC sid
In DepthDetails US Patent
TargetDipeptidyl peptidase 1(Homo sapiens (Human))
Astrazeneca
US Patent
LigandPNGBDBM385044(4′-[(2S)-2-Cyano-2-{[(2S)-1,4-oxazepan-2-ylc...)
Affinity DataIC50:  79.4nM. Assay description: Examples 1-35: The activity of DPP1 was determined by measuring the enzymatic release of aminomethyl coumarin (AMC) from the peptide substrate (H-Gly...
Ligand InfoPC cidPC sid
In DepthDetails US Patent
TargetDipeptidyl peptidase 1(Homo sapiens (Human))
Astrazeneca
US Patent
LigandPNGBDBM385044(4′-[(2S)-2-Cyano-2-{[(2S)-1,4-oxazepan-2-ylc...)
Affinity DataIC50:  79.4nM. Assay description: The activity of DPP1 was determined by measuring the enzymatic release of aminomethyl coumarin (AMC) from the peptide substrate (H-Gly-Arg-AMC), whic...
Ligand InfoPC cidPC sid
In DepthDetails US Patent
TargetDipeptidyl peptidase 1(Homo sapiens (Human))
Astrazeneca
US Patent
LigandPNGBDBM385044(4′-[(2S)-2-Cyano-2-{[(2S)-1,4-oxazepan-2-ylc...)
Affinity DataIC50:  79.4nM. Assay description: The activity of DPP1 was determined by measuring the enzymatic release of aminomethyl coumarin (AMC) from the peptide substrate (H-Gly-Arg-AMC), whic...
Ligand InfoPC cidPC sid
In DepthDetails US Patent